Target
Cytochrome P450 2D6
Ligand
BDBM50331234
Substrate
Meas. Tech.
ChEMBL_686515 (CHEMBL1292302)
IC50
>10000±n/a nM
Citation
 Surman, MDFreeman, EEGrabowski, JFHadden, MHenderson, AJJiang, GJiang, XMLuche, MKhmelnitsky, YVickers, SViggers, JCheetham, SGuzzo, PR 5-(pyridinon-1-yl)indazoles and 5-(furopyridinon-5-yl)indazoles as MCH-1 antagonists. Bioorg Med Chem Lett 20:7015-9 (2010)  
Target
Name:
Cytochrome P450 2D6
Synonyms:
CP2D6_HUMAN CYP2DL1 Cytochrome P450 2D6 (CYP2D6) P450-DB1
Type:
Protein
Mol. Mass.:
55774.82
Organism:
Homo sapiens (Human)
Description:
P10635
Residue:
497
  
Inhibitor
Name:
BDBM50331234
Synonyms:
(S)-4-(benzyloxy)-1-(1-(2-(3-hydroxypyrrolidin-1-yl)ethyl)-1H-indazol-5-yl)pyridin-2(1H)-one | CHEMBL1289515
Type:
Small organic molecule
Emp. Form.:
C25H26N4O3
Mol. Mass.:
430.4989
SMILES:
O[C@H]1CCN(CCn2ncc3cc(ccc23)-n2ccc(OCc3ccccc3)cc2=O)C1
: