Target
Steryl-sulfatase
Ligand
BDBM50355371
Substrate
Meas. Tech.
ChEMBL_773113 (CHEMBL1839049)
IC50
26000±n/a nM
Citation
 Phan, CMLiu, YKim, BMMostafa, YTaylor, SD Inhibition of steroid sulfatase with 4-substituted estrone and estradiol derivatives. Bioorg Med Chem 19:5999-6005 (2011)  
Target
Name:
Steryl-sulfatase
Synonyms:
ARSC1 Arylsulfatase C STS_HUMAN Steryl-sulfate sulfohydrolase
Type:
Enzyme
Mol. Mass.:
65503.66
Organism:
Homo sapiens (Human)
Description:
P08842
Residue:
583
  
Inhibitor
Name:
BDBM50355371
Synonyms:
CHEMBL1835543
Type:
Small organic molecule
Emp. Form.:
C18H20N2O6
Mol. Mass.:
360.3612
SMILES:
C[C@]12CC[C@H]3[C@@H](CCc4c3cc(c(O)c4[N+]([O-])=O)[N+]([O-])=O)[C@@H]1CCC2=O
: