Target
Alpha-1A adrenergic receptor
Ligand
BDBM50026974
Substrate
Meas. Tech.
ChEBML_33098
Ki
44±n/a nM
Citation
 Remy, DCBritcher, SFKing, SWAnderson, PSHunt, CARandall, WCBélanger, PAtkinson, JGGirard, YRooney, CSFuentes, JJTotaro, JARobinson, JLRisley, EAWilliams, M Synthesis and receptor binding studies relevant to the neuroleptic activities of some 1-methyl-4-piperidylidene-9-substituted-pyrrolo[2,1-b][3]benzazepine derivatives. J Med Chem 26:974-80 (1983)  
Target
Name:
Alpha-1A adrenergic receptor
Synonyms:
ADA1A_BOVIN ADRA1C Alpha 1A-adrenoreceptor Cerebral cortex alpha adrenergic receptor | adrenergic Alpha1
Type:
Enzyme Catalytic Domain
Mol. Mass.:
51492.08
Organism:
CALF
Description:
adrenergic Alpha1 0 CALF
Residue:
466
  
Inhibitor
Name:
BDBM50026974
Synonyms:
9-Bromo-11-(1-methyl-piperidin-4-ylidene)-6,11-dihydro-5H-benzo[d]pyrrolo[1,2-a]azepine | CHEMBL175508
Type:
Small organic molecule
Emp. Form.:
C19H21BrN2
Mol. Mass.:
357.287
SMILES:
[#6]-[#7]-1-[#6]-[#6]\[#6](-[#6]-[#6]-1)=[#6]-1/c2cccn2-[#6]-[#6]-c2ccc(Br)cc-12
: