Target
D(2) dopamine receptor
Ligand
BDBM50369665
Substrate
Meas. Tech.
ChEMBL_59915 (CHEMBL671074)
IC50
146±n/a nM
Citation
 Zhang, XHodgetts, KRachwal, SZhao, HWasley, JWCraven, KBrodbeck, RKieltyka, AHoffman, DBacolod, MDGirard, BTran, JThurkauf, A trans-1-[(2-Phenylcyclopropyl)methyl]-4-arylpiperazines: mixed dopamine D(2)/D(4) receptor antagonists as potential antipsychotic agents. J Med Chem 43:3923-32 (2000)  
Target
Name:
D(2) dopamine receptor
Synonyms:
D(2) dopamine receptor DOPAMINE D2 Long DRD2 Dopamine D2 receptor Dopamine D2 receptor (D2R) Dopamine2-like | d2
Type:
Cell-surface receptors
Mol. Mass.:
50647.10
Organism:
Homo sapiens (Human)
Description:
P14416
Residue:
443
  
Inhibitor
Name:
BDBM50369665
Synonyms:
CHEMBL1202221
Type:
Small organic molecule
Emp. Form.:
C20H23ClN2
Mol. Mass.:
326.863
SMILES:
Clc1cccc(c1)N1CCN(C[C@H]2C[C@@H]2c2ccccc2)CC1
: