Target
Cholinesterase
Ligand
BDBM50107891
Substrate
Meas. Tech.
ChEMBL_41426 (CHEMBL654406)
IC50
79.30±n/a nM
Citation
 Camps, PGómez, EMuñoz-Torrero, DBadia, AVivas, NMBarril, XOrozco, MLuque, FJ Synthesis, in vitro pharmacology, and molecular modeling of syn-huprines as acetylcholinesterase inhibitors. J Med Chem 44:4733-6 (2001)  
Target
Name:
Cholinesterase
Synonyms:
Acylcholine acylhydrolase Butyrylcholine esterase (BChE) Butyrylcholinesterase (BuChE) CHLE_HUMAN Cholinesterases Pseudocholinesterase
Type:
Homotetramer
Mol. Mass.:
68422.27
Organism:
Homo sapiens (Human)
Description:
P06276
Residue:
602
  
Inhibitor
Name:
BDBM50107891
Synonyms:
(+/-) 15-ethyl-10-azatetracyclo[11.3.1.02,11.04,9]heptadeca-2(11),3,5,7,9,14-hexaen-3-amine; hydrochloride | CHEMBL539051
Type:
Small organic molecule
Emp. Form.:
C18H20N2
Mol. Mass.:
264.3648
SMILES:
CCC1=CC2CC(C1)c1c(C2)nc2ccccc2c1N
: