Target
C-X-C chemokine receptor type 2
Ligand
BDBM50152761
Substrate
Meas. Tech.
ChEMBL_306403 (CHEMBL828744)
IC50
7±n/a nM
Citation
 Jin, QNie, HMcCleland, BWWiddowson, KLPalovich, MRElliott, JDGoodman, RMBurman, MSarau, HMWard, KWNord, MOrr, BMGorycki, PDBusch-Petersen, J Discovery of potent and orally bioavailable N,N'-diarylurea antagonists for the CXCR2 chemokine receptor. Bioorg Med Chem Lett 14:4375-8 (2004)  
Target
Name:
C-X-C chemokine receptor type 2
Synonyms:
C-X-C chemokine receptor type 2 (CXCR-2) CD_antigen=CD182 CXCR-2 CXCR2_HUMAN GRO/MGSA receptor IL-8 receptor type 2 IL8RB | Interleukin-8 receptor B
Type:
Protein
Mol. Mass.:
40767.88
Organism:
Homo sapiens (Human)
Description:
P25025
Residue:
360
  
Inhibitor
Name:
BDBM50152761
Synonyms:
3-[3-(2-Bromo-phenyl)-ureido]-6-chloro-2-hydroxy-benzenesulfonamide | CHEMBL359670
Type:
Small organic molecule
Emp. Form.:
C13H11BrClN3O4S
Mol. Mass.:
420.666
SMILES:
NS(=O)(=O)c1c(Cl)ccc(NC(=O)Nc2ccccc2Br)c1O
: