Target
C-X-C chemokine receptor type 1
Ligand
BDBM50152761
Substrate
Meas. Tech.
ChEMBL_306402 (CHEMBL828743)
IC50
1366±n/a nM
Citation
 Jin, QNie, HMcCleland, BWWiddowson, KLPalovich, MRElliott, JDGoodman, RMBurman, MSarau, HMWard, KWNord, MOrr, BMGorycki, PDBusch-Petersen, J Discovery of potent and orally bioavailable N,N'-diarylurea antagonists for the CXCR2 chemokine receptor. Bioorg Med Chem Lett 14:4375-8 (2004)  
Target
Name:
C-X-C chemokine receptor type 1
Synonyms:
C-X-C chemokine receptor type 1 (CXCR-1) CMKAR1 CXCR1_HUMAN Interleukin-8 receptor A | Interleukin-8 receptors, CXCR1/CXCR2
Type:
Enzyme
Mol. Mass.:
39803.83
Organism:
Homo sapiens (Human)
Description:
P25024
Residue:
350
  
Inhibitor
Name:
BDBM50152761
Synonyms:
3-[3-(2-Bromo-phenyl)-ureido]-6-chloro-2-hydroxy-benzenesulfonamide | CHEMBL359670
Type:
Small organic molecule
Emp. Form.:
C13H11BrClN3O4S
Mol. Mass.:
420.666
SMILES:
NS(=O)(=O)c1c(Cl)ccc(NC(=O)Nc2ccccc2Br)c1O
: