Target
Alpha-2C adrenergic receptor
Ligand
BDBM50209684
Substrate
Meas. Tech.
ChEMBL_436122 (CHEMBL905524)
Ki
8.30±n/a nM
Citation
 Andrés, JIAlcázar, JAlonso, JMAlvarez, RMBakker, MHBiesmans, ICid, JMDe Lucas, AIDrinkenburg, WFernández, JFont, LMIturrino, LLanglois, XLenaerts, IMartínez, SMegens, AAPastor, JPullan, SSteckler, T Tricyclic isoxazolines: identification of R226161 as a potential new antidepressant that combines potent serotonin reuptake inhibition and alpha2-adrenoceptor antagonism. Bioorg Med Chem 15:3649-60 (2007)  
Target
Name:
Alpha-2C adrenergic receptor
Synonyms:
ADA2C_HUMAN ADRA2L2 Adrenergic alpha2C Adrenergic receptor alpha Alpha-2 adrenergic receptor subtype C4 Alpha-2C adrenoreceptor | adrenergic, alpha-2C-, receptor [Homo sapiens]
Type:
Enzyme
Mol. Mass.:
49552.32
Organism:
Homo sapiens (Human)
Description:
P18825
Residue:
462
  
Inhibitor
Name:
BDBM50209684
Synonyms:
CHEMBL390718 cis-(+/-)-7,8-dimethoxy-3-[4-(2-methyl-3-phenyl-2(E)-propen-1-yl)piperazin-1-ylmethyl]-3,3a,4,5-tetrahydroquinolino[4,3-c]isoxazole | cis-(-)-7,8-dimethoxy-3-[4-(2-methyl-3-phenyl-2(E)-propen-1-yl)piperazin-1-ylmethyl]-3,3a,4,5-tetrahydroquinolino[4,3-c]isoxazole
Type:
Small organic molecule
Emp. Form.:
C27H34N4O3
Mol. Mass.:
462.5839
SMILES:
COc1cc2NCC3C(CN4CCN(C\C(C)=C\c5ccccc5)CC4)ON=C3c2cc1OC
: