Target
Growth hormone secretagogue receptor type 1
Ligand
BDBM50235849
Substrate
Meas. Tech.
ChEMBL_462860 (CHEMBL928778)
EC50
0.51±n/a nM
Citation
 Li, JChen, SYTao, SWang, HLi, JJSwartz, SMusial, CHernandez, AAFlynn, NMurphy, BJBeehler, BDickinson, KEGiupponi, LGrover, GSeethala, RSleph, PSlusarchyk, DYan, MHumphreys, WGZhang, HEwing, WRRobl, JAGordon, DTino, JA Design and synthesis of tetrazole-based growth hormone secretagogue: the SAR studies of the O-benzyl serine side chain. Bioorg Med Chem Lett 18:1825-9 (2008)  
Target
Name:
Growth hormone secretagogue receptor type 1
Synonyms:
GH-releasing peptide receptor GHS-R GHSR_HUMAN Ghrelin receptor | Ghrelin receptor 1a (GHS-R1a)
Type:
Receptor
Mol. Mass.:
41334.57
Organism:
Homo sapiens (Human)
Description:
Receptor binding studies use plasma membranes from LLC PK-1 cells transiently transfected with hGHSR1a.
Residue:
366
  
Inhibitor
Name:
BDBM50235849
Synonyms:
(4-hydroxy-butyl)-carbamic acid 2-{5-[(S)-1-(2-amino-2-methyl-propionylamino)-2-(2-methyl-benzyloxy)-ethyl]-tetrazol-1-yl}-ethyl ester | CHEMBL404354
Type:
Small organic molecule
Emp. Form.:
C22H35N7O5
Mol. Mass.:
477.5572
SMILES:
Cc1ccccc1COC[C@@H](NC(=O)C(C)(C)N)c1nnnn1CCOC(=O)NCCCCO
: