Target
Coagulation factor X
Ligand
BDBM50377653
Substrate
Meas. Tech.
ChEMBL_479811 (CHEMBL930381)
Ki
5.5±n/a nM
Citation
 Corte, JRFang, TPinto, DJHan, WHu, ZJiang, XJLi, YLGauuan, JFHadden, MOrton, DRendina, ARLuettgen, JMWong, PCHe, KMorin, PEChang, CHCheney, DLKnabb, RMWexler, RRLam, PY Structure-activity relationships of anthranilamide-based factor Xa inhibitors containing piperidinone and pyridinone P4 moieties. Bioorg Med Chem Lett 18:2845-9 (2008)  
Target
Name:
Coagulation factor X
Synonyms:
Activated coagulation factor X (FXa) Coagulation factor X precursor F10 Factor X heavy chain Factor Xa Stuart-Prower factor
Type:
Enzyme
Mol. Mass.:
54726.60
Organism:
Homo sapiens (Human)
Description:
Residue:
488
  
Inhibitor
Name:
BDBM50377653
Synonyms:
CHEMBL402761
Type:
Small organic molecule
Emp. Form.:
C23H17ClN4O4S
Mol. Mass.:
480.923
SMILES:
Clc1ccc(NS(=O)(=O)c2ccccc2NC(=O)c2ccc(cc2)-n2ccccc2=O)nc1
: