Target
Corticotropin-releasing factor receptor 1
Ligand
BDBM50272639
Substrate
Meas. Tech.
ChEMBL_510097 (CHEMBL998751)
Ki
>10000±n/a nM
Citation
 Yoon, TDe Lombaert, SBrodbeck, RGulianello, MKrause, JEHutchison, AHorvath, RFGe, PKehne, JHoffman, DChandrasekhar, JDoller, DHodgetts, KJ 2-Arylpyrimidines: novel CRF-1 receptor antagonists. Bioorg Med Chem Lett 18:4486-90 (2008)  
Target
Name:
Corticotropin-releasing factor receptor 1
Synonyms:
CRF-R CRF1 CRFR1 CRH-R 1 CRHR1 Corticotropin-releasing factor receptor 1 (CRF-1) Corticotropin-releasing hormone receptor 1
Type:
Enzyme
Mol. Mass.:
50744.31
Organism:
Homo sapiens (Human)
Description:
P34998
Residue:
444
  
Inhibitor
Name:
BDBM50272639
Synonyms:
4-methoxy-2-(2-methoxy-4,6-dimethylphenyl)-6-methyl-N-propylpyrimidin-5-amine | CHEMBL497465
Type:
Small organic molecule
Emp. Form.:
C18H25N3O2
Mol. Mass.:
315.41
SMILES:
CCCNc1c(C)nc(nc1OC)-c1c(C)cc(C)cc1OC
: