Target
Corticotropin-releasing factor receptor 1
Ligand
BDBM50272751
Substrate
Meas. Tech.
ChEMBL_510097 (CHEMBL998751)
Ki
33±n/a nM
Citation
 Yoon, TDe Lombaert, SBrodbeck, RGulianello, MKrause, JEHutchison, AHorvath, RFGe, PKehne, JHoffman, DChandrasekhar, JDoller, DHodgetts, KJ 2-Arylpyrimidines: novel CRF-1 receptor antagonists. Bioorg Med Chem Lett 18:4486-90 (2008)  
Target
Name:
Corticotropin-releasing factor receptor 1
Synonyms:
CRF-R CRF1 CRFR1 CRH-R 1 CRHR1 Corticotropin-releasing factor receptor 1 (CRF-1) Corticotropin-releasing hormone receptor 1
Type:
Enzyme
Mol. Mass.:
50744.31
Organism:
Homo sapiens (Human)
Description:
P34998
Residue:
444
  
Inhibitor
Name:
BDBM50272751
Synonyms:
4-chloro-2-(2-methoxy-4,6-dimethylphenyl)-6-methyl-N,N-dipropylpyrimidin-5-amine | CHEMBL498319
Type:
Small organic molecule
Emp. Form.:
C20H28ClN3O
Mol. Mass.:
361.909
SMILES:
CCCN(CCC)c1c(C)nc(nc1Cl)-c1c(C)cc(C)cc1OC
: