Target
Beta-1 adrenergic receptor
Ligand
BDBM50296960
Substrate
Meas. Tech.
ChEMBL_580943 (CHEMBL1054908)
EC50
>1000±n/a nM
Citation
 Hattori, KOrita, MToda, SImanishi, MItou, SNakajima, YTanabe, DWashizuka, KAraki, TSakurai, MMatsui, SImamura, EUeshima, KYamamoto, TYamamoto, NIshikawa, HNakano, KUnami, NHamada, KMatsumura, YTakamura, F Discovery of highly potent and selective biphenylacylsulfonamide-based beta3-adrenergic receptor agonists and molecular modeling based on the solved X-ray structure of the beta2-adrenergic receptor: part 6. Bioorg Med Chem Lett 19:4679-83 (2009)  
Target
Name:
Beta-1 adrenergic receptor
Synonyms:
ADRB1 ADRB1_HUMAN Beta-1 adrenoceptor adrenergic Beta1
Type:
G Protein-Coupled Receptor (GPCR)
Mol. Mass.:
51338.40
Organism:
Homo sapiens (Human)
Description:
P08588
Residue:
477
  
Inhibitor
Name:
BDBM50296960
Synonyms:
(R)-4'-(2-(2-(6-acetamidopyridin-3-yl)-2-hydroxyethylamino)ethyl)-3-(cyclohexyloxy)-N-(methylsulfonyl)biphenyl-4-carboxamide | CHEMBL559334
Type:
Small organic molecule
Emp. Form.:
C31H38N4O6S
Mol. Mass.:
594.722
SMILES:
CC(=O)Nc1ccc(cn1)[C@@H](O)CNCCc1ccc(cc1)-c1ccc(C(=O)NS(C)(=O)=O)c(OC2CCCCC2)c1
: