Target
Tyrosine-protein kinase JAK3
Ligand
BDBM50303084
Substrate
Meas. Tech.
ChEMBL_597288 (CHEMBL1044319)
IC50
4000±n/a nM
Citation
 Ledeboer, MWPierce, ACDuffy, JPGao, HMessersmith, DSalituro, FGNanthakumar, SCome, JZuccola, HJSwenson, LShlyakter, DMahajan, SHoock, TFan, BTsai, WJKolaczkowski, ECarrier, SHogan, JKZessis, RPazhanisamy, SBennani, YL 2-Aminopyrazolo[1,5-a]pyrimidines as potent and selective inhibitors of JAK2. Bioorg Med Chem Lett 19:6529-33 (2009)  
Target
Name:
Tyrosine-protein kinase JAK3
Synonyms:
JAK-3 JAK3_HUMAN Janus kinase 3 (JAK3) L-JAK | Leukocyte janus kinase
Type:
Protein
Mol. Mass.:
125111.08
Organism:
Homo sapiens (Human)
Description:
P52333
Residue:
1124
  
Inhibitor
Name:
BDBM50303084
Synonyms:
3-(6-(3-(dimethylamino)pyrrolidin-1-yl)pyrimidin-4-yl)pyrazolo[1,5-a]pyrimidin-2-amine | CHEMBL585527
Type:
Small organic molecule
Emp. Form.:
C16H20N8
Mol. Mass.:
324.3836
SMILES:
CN(C)C1CCN(C1)c1cc(ncn1)-c1c(N)nn2cccnc12
: