Target
Cytochrome P450 2C9
Ligand
BDBM50318669
Substrate
Meas. Tech.
ChEMBL_633293 (CHEMBL1119997)
IC50
>10000±n/a nM
Citation
 Yeung, BKZou, BRottmann, MLakshminarayana, SBAng, SHLeong, SYTan, JWong, JKeller-Maerki, SFischli, CGoh, ASchmitt, EKKrastel, PFrancotte, EKuhen, KPlouffe, DHenson, KWagner, TWinzeler, EAPetersen, FBrun, RDartois, VDiagana, TTKeller, TH Spirotetrahydro beta-carbolines (spiroindolones): a new class of potent and orally efficacious compounds for the treatment of malaria. J Med Chem 53:5155-64 (2010)  
Target
Name:
Cytochrome P450 2C9
Synonyms:
(R)-limonene 6-monooxygenase CP2C9_HUMAN CYP2C9 Cytochrome P450 2C9 (CYP2C9 ) P-450MP P450 PB-1 | S-mephenytoin 4-hydroxylase
Type:
Enzyme
Mol. Mass.:
55636.33
Organism:
Homo sapiens (Human)
Description:
P11712
Residue:
490
  
Inhibitor
Name:
BDBM50318669
Synonyms:
(1S,3R)-5'-Chloro-6-fluoro-3-methyl-2,3,4,9-tetrahydrospiro-[beta-carboline-1,3'-indol]-2'(1'H)-one | CHEMBL1083219
Type:
Small organic molecule
Emp. Form.:
C19H15ClFN3O
Mol. Mass.:
355.793
SMILES:
C[C@@H]1Cc2c([nH]c3ccc(F)cc23)[C@]2(N1)C(=O)Nc1ccc(Cl)cc21
: