Target
Acetylcholinesterase
Ligand
BDBM50384794
Substrate
Meas. Tech.
ChEMBL_821065 (CHEMBL2039391)
IC50
570±n/a nM
Citation
 Silva, DChioua, MSamadi, ACarmo Carreiras, MJimeno, MLMendes, ERíos, Cde LRomero, AVillarroya, MLópez, MGMarco-Contelles, J Synthesis and pharmacological assessment of diversely substituted pyrazolo[3,4-b]quinoline, and benzo[b]pyrazolo[4,3-g][1,8]naphthyridine derivatives. Eur J Med Chem 46:4676-81 (2011)  
Target
Name:
Acetylcholinesterase
Synonyms:
ACES_ELEEL Acetylcholinesterase (EeAChE) | ache
Type:
Enzyme
Mol. Mass.:
71812.79
Organism:
Electrophorus electricus (Electric eel)
Description:
Residue:
633
  
Inhibitor
Name:
BDBM50384794
Synonyms:
CHEMBL2037380
Type:
Small organic molecule
Emp. Form.:
C12H13N5
Mol. Mass.:
227.2651
SMILES:
Cn1nc2nc3CCCCc3c(N)c2c1C#N
: