Target
Cholinesterase
Ligand
BDBM50384795
Substrate
Meas. Tech.
ChEMBL_821066 (CHEMBL2039392)
IC50
6300±n/a nM
Citation
 Silva, DChioua, MSamadi, ACarmo Carreiras, MJimeno, MLMendes, ERíos, Cde LRomero, AVillarroya, MLópez, MGMarco-Contelles, J Synthesis and pharmacological assessment of diversely substituted pyrazolo[3,4-b]quinoline, and benzo[b]pyrazolo[4,3-g][1,8]naphthyridine derivatives. Eur J Med Chem 46:4676-81 (2011)  
Target
Name:
Cholinesterase
Synonyms:
BCHE CHLE_HORSE | Cholinesterase
Type:
Enzyme
Mol. Mass.:
65643.35
Organism:
Equus caballus (Horse)
Description:
P81908
Residue:
574
  
Inhibitor
Name:
BDBM50384795
Synonyms:
CHEMBL2037381
Type:
Small organic molecule
Emp. Form.:
C12H13N5
Mol. Mass.:
227.2651
SMILES:
Cn1nc(C#N)c2c(N)c3CCCCc3nc12
: