Target
Metabotropic glutamate receptor 1
Ligand
BDBM50301520
Substrate
Meas. Tech.
ChEMBL_833080 (CHEMBL2067284)
IC50
13.9±n/a nM
Citation
 Fujinaga, MYamasaki, TYui, JHatori, AXie, LKawamura, KAsagawa, CKumata, KYoshida, YOgawa, MNengaki, NFukumura, TZhang, MR Synthesis and evaluation of novel radioligands for positron emission tomography imaging of metabotropic glutamate receptor subtype 1 (mGluR1) in rodent brain. J Med Chem 55:2342-52 (2012)  
Target
Name:
Metabotropic glutamate receptor 1
Synonyms:
GRM1_RAT Grm1 Metabotropic glutamate receptor Mglur1 metabotropic glutamate 1/5-D metabotropic glutamate receptor 1 isoform alpha precursor
Type:
Enzyme Catalytic Domain
Mol. Mass.:
133240.47
Organism:
RAT
Description:
metabotropic glutamate 1/2 0 RAT::P23385
Residue:
1199
  
Inhibitor
Name:
BDBM50301520
Synonyms:
4-fluoro-N-(4-(6-(isopropylamino)pyrimidin-4-yl)thiazol-2-yl)-N-methylbenzamide | CHEMBL566581
Type:
Small organic molecule
Emp. Form.:
C18H18FN5OS
Mol. Mass.:
371.432
SMILES:
CC(C)Nc1cc(ncn1)-c1csc(n1)N(C)C(=O)c1ccc(F)cc1
: