Target
P2X purinoceptor 7
Ligand
BDBM50426571
Substrate
Meas. Tech.
ChEMBL_938661 (CHEMBL2327433)
IC50
0.01±n/a nM
Citation
 Bagal, SKBrown, ADCox, PJOmoto, KOwen, RMPryde, DCSidders, BSkerratt, SEStevens, EBStorer, RISwain, NA Ion channels as therapeutic targets: a drug discovery perspective. J Med Chem 56:593-624 (2013)  
Target
Name:
P2X purinoceptor 7
Synonyms:
ATP receptor P2RX7_HUMAN P2X purinoceptor 7 (P2X7) P2Z receptor | Purinergic receptor
Type:
Protein
Mol. Mass.:
68602.85
Organism:
Homo sapiens (Human)
Description:
Q99572
Residue:
595
  
Inhibitor
Name:
BDBM50426571
Synonyms:
CHEMBL2324343
Type:
Small organic molecule
Emp. Form.:
C22H21F4N3O2
Mol. Mass.:
435.4147
SMILES:
C[C@H](CN)n1ccc2c(NC(=O)Cc3ccc(c(F)c3)C(F)(F)F)c(C)ccc2c1=O
: