Target
Platelet-derived growth factor receptor beta
Ligand
BDBM4810
Substrate
Meas. Tech.
ChEMBL_947885 (CHEMBL2343161)
IC50
400±n/a nM
Citation
 Nosaka, CAdachi, HSawa, RNakae, KAtsumi, SKinoshita, NKubota, YIgarashi, MSei, YYamaguchi, KShibuya, MNishimura, YAkamatsu, Y Vegfrecine, an inhibitor of VEGF receptor tyrosine kinases isolated from the culture broth of Streptomyces sp. J Nat Prod 76:715-9 (2013)  
Target
Name:
Platelet-derived growth factor receptor beta
Synonyms:
Beta-type platelet-derived growth factor receptor CD140b antigen PDGF Receptor Substrate PDGFR PDGFR-1 PDGFRB PGFRB_HUMAN Platelet-derived growth factor receptor 1 Platelet-derived growth factor receptor beta (PDGFR-beta) Platelet-derived growth factor receptor beta (PDGFRbeta) | VHL/PDGFRB
Type:
Enzyme
Mol. Mass.:
123922.25
Organism:
Homo sapiens (Human)
Description:
P09619
Residue:
1106
  
Inhibitor
Name:
BDBM4810
Synonyms:
(3Z)-3-[(3,5-dimethyl-1H-pyrrol-2-yl)methylidene]-2,3-dihydro-1H-indol-2-one CHEMBL276711 SU5416 US10189853, semaxanib US9422297, SU5416 | cid_5329098
Type:
Small organic molecule
Emp. Form.:
C15H14N2O
Mol. Mass.:
238.2845
SMILES:
Cc1cc(C)c(\C=C2/C(=O)Nc3ccccc23)[nH]1
: