Target
Epidermal growth factor receptor
Ligand
BDBM50428367
Substrate
Meas. Tech.
ChEMBL_947883 (CHEMBL2343159)
IC50
2600±n/a nM
Citation
 Nosaka, CAdachi, HSawa, RNakae, KAtsumi, SKinoshita, NKubota, YIgarashi, MSei, YYamaguchi, KShibuya, MNishimura, YAkamatsu, Y Vegfrecine, an inhibitor of VEGF receptor tyrosine kinases isolated from the culture broth of Streptomyces sp. J Nat Prod 76:715-9 (2013)  
Target
Name:
Epidermal growth factor receptor
Synonyms:
EGF Receptor Substrate EGFR_HUMAN ERBB1 Epidermal Growth Factor Receptor erbB-1 Epidermal growth factor receptor (EGFR) HER1 Proto-oncogene c-ErbB-1 Tyrosine-Protein Kinase ErbB-1
Type:
Receptor Kinase Domain
Mol. Mass.:
134279.59
Organism:
Homo sapiens (Human)
Description:
P00533
Residue:
1210
  
Inhibitor
Name:
BDBM50428367
Synonyms:
CHEMBL2332119 | Vegfrecine
Type:
Small organic molecule
Emp. Form.:
C13H11N3O4
Mol. Mass.:
273.2441
SMILES:
NC(=O)C1=C(N)C(=O)C=C(Nc2ccccc2O)C1=O
: