Target
Vascular endothelial growth factor receptor 1
Ligand
BDBM50428367
Substrate
Meas. Tech.
ChEMBL_947888 (CHEMBL2343631)
IC50
18±n/a nM
Citation
 Nosaka, CAdachi, HSawa, RNakae, KAtsumi, SKinoshita, NKubota, YIgarashi, MSei, YYamaguchi, KShibuya, MNishimura, YAkamatsu, Y Vegfrecine, an inhibitor of VEGF receptor tyrosine kinases isolated from the culture broth of Streptomyces sp. J Nat Prod 76:715-9 (2013)  
Target
Name:
Vascular endothelial growth factor receptor 1
Synonyms:
FLT FRT Fms-like tyrosine kinase 1 Tyrosine-protein kinase FRT VEGFR-1 VGFR1_HUMAN Vascular endothelial growth factor receptor 1 (FLT1) Vascular endothelial growth factor receptor 1 and 2 (Flt-1 and KDR) Vascular permeability factor receptor vascular endothelial growth factor/vascular permeability factor receptor
Type:
Receptor Tyrosine Kinase
Mol. Mass.:
150800.23
Organism:
Homo sapiens (Human)
Description:
P17948
Residue:
1338
  
Inhibitor
Name:
BDBM50428367
Synonyms:
CHEMBL2332119 | Vegfrecine
Type:
Small organic molecule
Emp. Form.:
C13H11N3O4
Mol. Mass.:
273.2441
SMILES:
NC(=O)C1=C(N)C(=O)C=C(Nc2ccccc2O)C1=O
: