Target
Interleukin-1 receptor-associated kinase 4
Ligand
BDBM50108080
Substrate
Meas. Tech.
ChEMBL_1509409 (CHEMBL3603417)
IC50
6.0±n/a nM
Citation
 Seganish, WMMcElroy, WTHerr, RJBrumfield, SGreenlee, WJHarding, JKomanduri, VMatasi, JPrakash, KCTulshian, DYang, JYet, LDevito, KFossetta, JGarlisi, CGLundell, DNiu, XSondey, C Initial optimization and series evolution of diaminopyrimidine inhibitors of interleukin-1 receptor associated kinase 4. Bioorg Med Chem Lett 25:3203-7 (2015)  
Target
Name:
Interleukin-1 receptor-associated kinase 4
Synonyms:
IRAK-4 IRAK4_HUMAN Interleukin-1 receptor-associated kinase 4 (IRAK4) | Renal carcinoma antigen NY-REN-64
Type:
Protein
Mol. Mass.:
51519.08
Organism:
Homo sapiens (Human)
Description:
Q9NWZ3
Residue:
460
  
Inhibitor
Name:
BDBM50108080
Synonyms:
CHEMBL3601078
Type:
Small organic molecule
Emp. Form.:
C20H20N8O3S
Mol. Mass.:
452.49
SMILES:
OC[C@H]1C[C@@H](Nc2nc(Nc3cncnc3)ncc2-c2nc3ccncc3s2)[C@H](O)[C@@H]1O
: