Target
Sodium channel protein type 1 subunit alpha
Ligand
BDBM50117271
Substrate
Meas. Tech.
ChEMBL_1525512 (CHEMBL3636865)
IC50
11000±n/a nM
Citation
 Suzuki, SKuroda, TKimoto, HDomon, YKubota, KKitano, YYokoyama, TShimizugawa, ASugita, RKoishi, RAsano, DTamaki, KShinozuka, TKobayashi, H Discovery of (phenoxy-2-hydroxypropyl)piperidines as a novel class of voltage-gated sodium channel 1.7 inhibitors. Bioorg Med Chem Lett 25:5419-23 (2015)  
Target
Name:
Sodium channel protein type 1 subunit alpha
Synonyms:
NAC1 SCN1A Sodium (Site 1) Sodium channel protein type 1 subunit alpha Sodium channel protein type I subunit alpha Voltage-gated sodium channel subunit alpha Nav1.1
Type:
Protein
Mol. Mass.:
228952.47
Organism:
Homo sapiens (Human)
Description:
P35498
Residue:
2009
  
Inhibitor
Name:
BDBM50117271
Synonyms:
1-(2,6-dimethylphenoxy)-2-propanolamine 2-(2,6-Dimethyl-phenoxy)-1-methyl-ethylamine CHEMBL558 Mexitil
Type:
Small organic molecule
Emp. Form.:
C11H17NO
Mol. Mass.:
179.2588
SMILES:
CC(N)COc1c(C)cccc1C
: