Target
Lysine-specific demethylase 4C
Ligand
BDBM50151403
Substrate
Meas. Tech.
ChEMBL_1561029 (CHEMBL3776325)
IC50
560±n/a nM
Citation
 Korczynska, MLe, DDYounger, NGregori-Puigjané, ETumber, AKrojer, TVelupillai, SGileadi, CNowak, RPIwasa, EPollock, SBOrtiz Torres, IOppermann, UShoichet, BKFujimori, DG Docking and Linking of Fragments To Discover Jumonji Histone Demethylase Inhibitors. J Med Chem 59:1580-98 (2016)  
Target
Name:
Lysine-specific demethylase 4C
Synonyms:
GASC-1 protein Gene amplified in squamous cell carcinoma 1 protein JMJD2C Jumonji domain-containing protein 2C KDM4C_HUMAN | KIAA0780
Type:
Protein
Mol. Mass.:
119979.01
Organism:
Homo sapiens (Human)
Description:
Q9H3R0
Residue:
1056
  
Inhibitor
Name:
BDBM50151403
Synonyms:
CHEMBL3774705
Type:
Small organic molecule
Emp. Form.:
C20H16N2O5
Mol. Mass.:
364.3514
SMILES:
OC(=O)c1ccnc(c1)-c1cc(NCc2cccc3OCOc23)ccc1O
: