Target
Lysine-specific demethylase 4C
Ligand
BDBM50151395
Substrate
Meas. Tech.
ChEMBL_1561030 (CHEMBL3776326)
IC50
3400±n/a nM
Citation
 Korczynska, MLe, DDYounger, NGregori-Puigjané, ETumber, AKrojer, TVelupillai, SGileadi, CNowak, RPIwasa, EPollock, SBOrtiz Torres, IOppermann, UShoichet, BKFujimori, DG Docking and Linking of Fragments To Discover Jumonji Histone Demethylase Inhibitors. J Med Chem 59:1580-98 (2016)  
Target
Name:
Lysine-specific demethylase 4C
Synonyms:
GASC-1 protein Gene amplified in squamous cell carcinoma 1 protein JMJD2C Jumonji domain-containing protein 2C KDM4C_HUMAN | KIAA0780
Type:
Protein
Mol. Mass.:
119979.01
Organism:
Homo sapiens (Human)
Description:
Q9H3R0
Residue:
1056
  
Inhibitor
Name:
BDBM50151395
Synonyms:
CHEMBL3775162
Type:
Small organic molecule
Emp. Form.:
C20H15BrN2O4
Mol. Mass.:
427.248
SMILES:
OC(=O)c1ccnc(c1)-c1cc(NC(=O)Cc2cccc(Br)c2)ccc1O
: