Target
Lysine-specific demethylase 4C
Ligand
BDBM50151392
Substrate
Meas. Tech.
ChEMBL_1561031 (CHEMBL3776327)
IC50
4800±n/a nM
Citation
 Korczynska, MLe, DDYounger, NGregori-Puigjané, ETumber, AKrojer, TVelupillai, SGileadi, CNowak, RPIwasa, EPollock, SBOrtiz Torres, IOppermann, UShoichet, BKFujimori, DG Docking and Linking of Fragments To Discover Jumonji Histone Demethylase Inhibitors. J Med Chem 59:1580-98 (2016)  
Target
Name:
Lysine-specific demethylase 4C
Synonyms:
GASC-1 protein Gene amplified in squamous cell carcinoma 1 protein JMJD2C Jumonji domain-containing protein 2C KDM4C_HUMAN | KIAA0780
Type:
Protein
Mol. Mass.:
119979.01
Organism:
Homo sapiens (Human)
Description:
Q9H3R0
Residue:
1056
  
Inhibitor
Name:
BDBM50151392
Synonyms:
CHEMBL3775262
Type:
Small organic molecule
Emp. Form.:
C19H14N2O5
Mol. Mass.:
350.3249
SMILES:
OC(=O)c1ccnc(c1)-c1cc(NC(=O)c2ccc(O)cc2)ccc1O
: