Target
Lysine-specific demethylase 4C
Ligand
BDBM50151399
Substrate
Meas. Tech.
ChEMBL_1561033 (CHEMBL3776329)
IC50
3300±n/a nM
Citation
 Korczynska, MLe, DDYounger, NGregori-Puigjané, ETumber, AKrojer, TVelupillai, SGileadi, CNowak, RPIwasa, EPollock, SBOrtiz Torres, IOppermann, UShoichet, BKFujimori, DG Docking and Linking of Fragments To Discover Jumonji Histone Demethylase Inhibitors. J Med Chem 59:1580-98 (2016)  
Target
Name:
Lysine-specific demethylase 4C
Synonyms:
GASC-1 protein Gene amplified in squamous cell carcinoma 1 protein JMJD2C Jumonji domain-containing protein 2C KDM4C_HUMAN | KIAA0780
Type:
Protein
Mol. Mass.:
119979.01
Organism:
Homo sapiens (Human)
Description:
Q9H3R0
Residue:
1056
  
Inhibitor
Name:
BDBM50151399
Synonyms:
CHEMBL3775380
Type:
Small organic molecule
Emp. Form.:
C15H14N2O5
Mol. Mass.:
302.2821
SMILES:
COCC(=O)Nc1ccc(O)c(c1)-c1cc(ccn1)C(O)=O
: