Target
Monoglyceride lipase
Ligand
BDBM50160284
Substrate
Meas. Tech.
ChEMBL_1566109 (CHEMBL3791993)
IC50
195±n/a nM
Citation
 Brindisi, MMaramai, SGemma, SBrogi, SGrillo, ADi Cesare Mannelli, LGabellieri, ELamponi, SSaponara, SGorelli, BTedesco, DBonfiglio, TLandry, CJung, KMArmirotti, ALuongo, LLigresti, APiscitelli, FBertucci, CDehouck, MPCampiani, GMaione, SGhelardini, CPittaluga, APiomelli, DDi Marzo, VButini, S Development and Pharmacological Characterization of Selective Blockers of 2-Arachidonoyl Glycerol Degradation with Efficacy in Rodent Models of Multiple Sclerosis and Pain. J Med Chem 59:2612-32 (2016)  
Target
Name:
Monoglyceride lipase
Synonyms:
HU-K5 Lysophospholipase-like MGL MGLL_HUMAN
Type:
Hydrolase
Mol. Mass.:
33264.56
Organism:
Homo sapiens (Human)
Description:
Human recombinant MGL (Cayman Chemical, cat# 10008354).
Residue:
303
  
Inhibitor
Name:
BDBM50160284
Synonyms:
CHEMBL3785379
Type:
Small organic molecule
Emp. Form.:
C24H22FN5O4
Mol. Mass.:
463.461
SMILES:
Fc1ccc(cc1)[C@@H]1[C@H](N(C2CCN(CC2)C(=O)n2cncn2)C1=O)c1ccc2OCOc2c1
: