Target
Mitogen-activated protein kinase 14
Ligand
BDBM50241084
Substrate
Meas. Tech.
Kinase Assay
Temperature
310.15±0 K
IC50
3.36e+4± 8e+2 nM
Citation
 Goettert, MSchattel, VKoch, PMerfort, ILaufer, S Biological evaluation and structural determinants of p38α mitogen-activated-protein kinase and c-Jun-N-terminal kinase 3 inhibition by flavonoids. Chembiochem 11:2579-88 (2010)  
Target
Name:
Mitogen-activated protein kinase 14
Synonyms:
CSAID-binding protein CSBP1 CSPB1 MAP kinase 14 MAP kinase p38 alpha MAPK14 MK14_HUMAN Mitogen-activated protein kinase p38 alpha Stress-activated protein kinase 2a | p38 MAP kinase alpha/beta
Type:
Serine/threonine-protein kinase
Mol. Mass.:
41286.76
Organism:
Homo sapiens (Human)
Description:
Q16539
Residue:
360
  
Inhibitor
Name:
BDBM50241084
Synonyms:
3'-Methoxyapigenin 5,7-dihydroxy-2-(4-hydroxy-3-methoxyphenyl)-4-benzopyrone 5,7-dihydroxy-2-(4-hydroxy-3-methoxyphenyl)-4H-chromen-4-one Chryseriol Chrysoeriol (26) cid_5280666
Type:
Small organic molecule
Emp. Form.:
C16H12O6
Mol. Mass.:
300.2629
SMILES:
COc1cc(ccc1O)-c1cc(=O)c2c(O)cc(O)cc2o1
: