Target
Ribosomal oxygenase 1
Ligand
BDBM223320
Substrate
Meas. Tech.
RapidFire MS Assay
IC50
<1e+5±NaN nM
Citation
 Tumber, ANuzzi, AHookway, ESHatch, SBVelupillai, SJohansson, CKawamura, ASavitsky, PYapp, CSzykowska, AWu, NBountra, CStrain-Damerell, CBurgess-Brown, NARuda, GFFedorov, OMunro, SEngland, KSNowak, RPSchofield, CJLa Thangue, NBPawlyn, CDavies, FMorgan, GAthanasou, NMüller, SOppermann, UBrennan, PE Potent and Selective KDM5 Inhibitor Stops Cellular Demethylation of H3K4me3 at Transcription Start Sites and Proliferation of MM1S Myeloma Cells. Cell Chem Biol 24:371-380 (2017)  
Target
Name:
Ribosomal oxygenase 1
Synonyms:
C14orf169 MAPJD RIOX1 | RIOX1_HUMAN
Type:
Enzyme
Mol. Mass.:
71083.86
Organism:
Homo sapiens (Human)
Description:
Q9H6W3
Residue:
641
  
Inhibitor
Name:
BDBM223320
Synonyms:
KDOAM-25
Type:
Small organic molecule
Emp. Form.:
C15H25N5O2
Mol. Mass.:
307.3913
SMILES:
CCN(CCN(C)C)C(=O)CNCc1cc(ccn1)C(N)=O
: