Target
Urokinase-type plasminogen activator
Ligand
BDBM50349390
Substrate
Meas. Tech.
ChEMBL_759352 (CHEMBL1809815)
IC50
6300±n/a nM
Citation
 Crocetti, LGiovannoni, MPSchepetkin, IAQuinn, MTKhlebnikov, AICilibrizzi, APiaz, VDGraziano, AVergelli, C Design, synthesis and evaluation of N-benzoylindazole derivatives and analogues as inhibitors of human neutrophil elastase. Bioorg Med Chem 19:4460-72 (2011)  
Target
Name:
Urokinase-type plasminogen activator
Synonyms:
PLAU UROK_HUMAN Urokinase-type plasminogen activator (uPA) | Urokinase-type plasminogen activator/surface receptor
Type:
Enzyme
Mol. Mass.:
48528.62
Organism:
Homo sapiens (Human)
Description:
P00749
Residue:
431
  
Inhibitor
Name:
BDBM50349390
Synonyms:
CHEMBL1808523
Type:
Small organic molecule
Emp. Form.:
C18H16N2O3
Mol. Mass.:
308.3312
SMILES:
CC(C)OC(=O)c1nn(C(=O)c2ccccc2)c2ccccc12
: