Target
Adenosine receptor A3
Ligand
BDBM50166742
Substrate
Meas. Tech.
ChEMBL_303757 (CHEMBL829800)
Ki
37±n/a nM
Citation
 Press, NJTaylor, RJFullerton, JDTranter, PMcCarthy, CKeller, THBrown, LCheung, RChristie, JHaberthuer, SHatto, JDKeenan, MMercer, MKPress, NESahri, HTuffnell, ARTweed, MFozard, JR A new orally bioavailable dual adenosine A2B/A3 receptor antagonist with therapeutic potential. Bioorg Med Chem Lett 15:3081-5 (2005)  
Target
Name:
Adenosine receptor A3
Synonyms:
A3 adenosine receptor (hA3) ADORA3 | Adenosine A3 receptor (A3AR)
Type:
G Protein-Coupled Receptor (GPCR)
Mol. Mass.:
36197.32
Organism:
Homo sapiens (Human)
Description:
P0DMS8
Residue:
318
  
Inhibitor
Name:
BDBM50166742
Synonyms:
3-[2-(3-Methyl-pyridin-2-ylamino)-5-[1,2,4]triazol-1-yl-thiazol-4-yl]-benzonitrile | CHEMBL194132
Type:
Small organic molecule
Emp. Form.:
C18H13N7S
Mol. Mass.:
359.408
SMILES:
Cc1cccc(Nc2nc(c(s2)-n2cncn2)-c2cccc(c2)C#N)n1
: