Target
cGMP-specific 3',5'-cyclic phosphodiesterase
Ligand
BDBM50207127
Substrate
Meas. Tech.
ChEMBL_454819 (CHEMBL886847)
IC50
8±n/a nM
Citation
 Arnold, NJArnold, RBeer, DBhalay, GCollingwood, SPCraig, SDevereux, NDodds, MDunstan, ARFairhurst, RAFarr, DFullerton, JDGlen, AGomez, SHaberthuer, SHatto, JDHowes, CJones, DKeller, THLeuenberger, BMoser, HEMuller, INaef, RNicklin, PASandham, DATurner, KLTweed, MFWatson, SJZurini, M Potent and selective xanthine-based inhibitors of phosphodiesterase 5. Bioorg Med Chem Lett 17:2376-9 (2007)  
Target
Name:
cGMP-specific 3',5'-cyclic phosphodiesterase
Synonyms:
3',5'-cyclic phosphodiesterase PDE5 PDE5A_HUMAN Phosphodiesterase 5 (PDE5) Phosphodiesterase 5A (PDE5A) cGMP-specific 3',5'-cyclic phosphodiesterase
Type:
Protein
Mol. Mass.:
99975.83
Organism:
Homo sapiens (Human)
Description:
O76074
Residue:
875
  
Inhibitor
Name:
BDBM50207127
Synonyms:
8-((6,7-dimethoxyisoquinolin-4-yl)methyl)-1-methyl-3-neopentyl-1H-purine-2,6(3H,7H)-dione | CHEMBL245841
Type:
Small organic molecule
Emp. Form.:
C23H27N5O4
Mol. Mass.:
437.4916
SMILES:
COc1cc2cncc(Cc3nc4n(CC(C)(C)C)c(=O)n(C)c(=O)c4[nH]3)c2cc1OC
: