Target
Histamine H3 receptor
Ligand
BDBM50315348
Substrate
Meas. Tech.
ChEMBL_625975 (CHEMBL1103494)
IC50
5800±n/a nM
Citation
 Cramp, SDyke, HJHiggs, CClark, DEGill, MSavy, PJennings, NPrice, SLockey, PMNorman, DPorres, SWilson, FJones, ARamsden, NMangano, RLeggate, DAndersson, MHale, R Identification and hit-to-lead exploration of a novel series of histamine H4 receptor inverse agonists. Bioorg Med Chem Lett 20:2516-9 (2010)  
Target
Name:
Histamine H3 receptor
Synonyms:
G-protein coupled receptor 97 HH3R HRH3 Histamine H3 receptor (H3) Histamine receptor (H3 and H4)
Type:
G Protein-Coupled Receptor (GPCR)
Mol. Mass.:
48691.47
Organism:
Homo sapiens (Human)
Description:
Binding assays were using CHO cells stably expressing hH3R receptors.
Residue:
445
  
Inhibitor
Name:
BDBM50315348
Synonyms:
(R)-8-chloro-4-(3-(methylamino)pyrrolidin-1-yl)benzofuro[3,2-d]pyrimidin-2-amine | CHEMBL1091874
Type:
Small organic molecule
Emp. Form.:
C15H16ClN5O
Mol. Mass.:
317.773
SMILES:
CN[C@@H]1CCN(C1)c1nc(N)nc2c3cc(Cl)ccc3oc12
: