Target
Mitogen-activated protein kinase 14
Ligand
BDBM50323655
Substrate
Meas. Tech.
ChEMBL_645062 (CHEMBL1211568)
IC50
140±n/a nM
Citation
 Montalban, AGBoman, EChang, CDCeide, SCDahl, RDalesandro, DDelaet, NGErb, EErnst, JTGibbs, AKahl, JKessler, LKucharski, JLum, CLundström, JMiller, SNakanishi, HRoberts, ESaiah, ESullivan, RUrban, JWang, ZLarson, CJ Optimization of alpha-ketoamide based p38 inhibitors through modifications to the region that binds to the allosteric site. Bioorg Med Chem Lett 20:4819-24 (2010)  
Target
Name:
Mitogen-activated protein kinase 14
Synonyms:
CSAID-binding protein CSBP1 CSPB1 MAP kinase 14 MAP kinase p38 alpha MAPK14 MK14_HUMAN Mitogen-activated protein kinase p38 alpha Stress-activated protein kinase 2a | p38 MAP kinase alpha/beta
Type:
Serine/threonine-protein kinase
Mol. Mass.:
41286.76
Organism:
Homo sapiens (Human)
Description:
Q16539
Residue:
360
  
Inhibitor
Name:
BDBM50323655
Synonyms:
5-tert-butyl-N-cyclopropyl-2-methoxy-3-(2-(4-(2-morpholinoethoxy)naphthalen-1-yl)-2-oxoacetamido)benzamide | CHEMBL1208830
Type:
Small organic molecule
Emp. Form.:
C33H39N3O6
Mol. Mass.:
573.6793
SMILES:
COc1c(NC(=O)C(=O)c2ccc(OCCN3CCOCC3)c3ccccc23)cc(cc1C(=O)NC1CC1)C(C)(C)C
: