Target
Vascular endothelial growth factor receptor 2
Ligand
BDBM50171387
Substrate
Meas. Tech.
ChEMBL_726802 (CHEMBL1686402)
Ki
530±n/a nM
Citation
 Kawakami, JKMartinez, YSasaki, BHarris, MKurata, WELau, AF Investigation of a novel molecular descriptor for the lead optimization of 4-aminoquinazolines as vascular endothelial growth factor receptor-2 inhibitors: application for quantitative structure-activity relationship analysis in lead optimization. Bioorg Med Chem Lett 21:1371-5 (2011)  
Target
Name:
Vascular endothelial growth factor receptor 2
Synonyms:
CD_antigen=CD309 Fetal liver kinase 1 (FLK-1) KDR Protein-tyrosine kinase receptor Flk-1 VEGFR-2 VEGFR2 Vascular Endothelial Growth Factor Receptor Kinase 2 Vascular endothelial growth factor receptor 2 (KDR) Vascular endothelial growth factor receptor 2 (VEGFR2) Vascular endothelial growth factor receptor-2 (VEGFR-2)
Type:
Receptor Tyrosine Kinase
Mol. Mass.:
151510.97
Organism:
Homo sapiens (Human)
Description:
P35968
Residue:
1356
  
Inhibitor
Name:
BDBM50171387
Synonyms:
2-Octyl-2H-pyrazolo[3,4-d]pyrimidin-4-ylamine | CHEMBL364717
Type:
Small organic molecule
Emp. Form.:
C13H21N5
Mol. Mass.:
247.3393
SMILES:
CCCCCCCCn1cc2c(N)ncnc2n1
: