Target
Chymotrypsinogen B
Ligand
BDBM50437996
Substrate
Meas. Tech.
ChEMBL_972955 (CHEMBL2412036)
IC50
46±n/a nM
Citation
 Crocetti, LSchepetkin, IACilibrizzi, AGraziano, AVergelli, CGiomi, DKhlebnikov, AIQuinn, MTGiovannoni, MP Optimization of N-benzoylindazole derivatives as inhibitors of human neutrophil elastase. J Med Chem 56:6259-72 (2013)  
Target
Name:
Chymotrypsinogen B
Synonyms:
A0A2R8YG87_HUMAN CTRB1 Chymotrypsin B chain B Chymotrypsinogen B
Type:
PROTEIN
Mol. Mass.:
27871.19
Organism:
Homo sapiens (Human)
Description:
ChEMBL_216634
Residue:
263
  
Inhibitor
Name:
BDBM50437996
Synonyms:
CHEMBL2409458
Type:
Small organic molecule
Emp. Form.:
C15H11N3O5S
Mol. Mass.:
345.33
SMILES:
CCOC(=O)c1nn(C(=O)c2ccsc2)c2ccc(cc12)[N+]([O-])=O
: