Target
Neutrophil elastase
Ligand
BDBM50437996
Substrate
Meas. Tech.
ChEMBL_972954 (CHEMBL2412035)
IC50
30±n/a nM
Citation
 Crocetti, LSchepetkin, IACilibrizzi, AGraziano, AVergelli, CGiomi, DKhlebnikov, AIQuinn, MTGiovannoni, MP Optimization of N-benzoylindazole derivatives as inhibitors of human neutrophil elastase. J Med Chem 56:6259-72 (2013)  
Target
Name:
Neutrophil elastase
Synonyms:
Bone marrow serine protease Coagulation factor X ELANE Elastase HLE Leukocyte elastase Medullasin Neutrophil elastase (HNE) PMN elastase Trypsin
Type:
Enzyme
Mol. Mass.:
28532.38
Organism:
Homo sapiens (Human)
Description:
P08246
Residue:
267
  
Inhibitor
Name:
BDBM50437996
Synonyms:
CHEMBL2409458
Type:
Small organic molecule
Emp. Form.:
C15H11N3O5S
Mol. Mass.:
345.33
SMILES:
CCOC(=O)c1nn(C(=O)c2ccsc2)c2ccc(cc12)[N+]([O-])=O
: