Target
Neurogenic locus notch homolog protein 1
Ligand
BDBM50074771
Substrate
Meas. Tech.
ChEMBL_1468307 (CHEMBL3412050)
IC50
1.000000±n/a nM
Citation
 Shan, WBalog, AQuesnelle, CGill, PHan, WCNorris, DMandal, SThiruvenkadam, RGona, KBThiyagarajan, KKandula, SMcGlinchey, KMenard, KWen, MLRose, AWhite, RGuarino, VShen, DRCvijic, MERanasinghe, ADai, JZhang, YWu, DRMathur, ARampulla, RTrainor, GHunt, JTVite, GDWesthouse, RLee, FYGavai, AV BMS-871: a novel orally active pan-Notch inhibitor as an anticancer agent. Bioorg Med Chem Lett 25:1905-9 (2015)  
Target
Name:
Neurogenic locus notch homolog protein 1
Synonyms:
NEXT NOTC1_HUMAN Neurogenic locus notch homolog protein 1 Notch 1 Notch 1 intracellular domain TAN1 hN1
Type:
Enzyme
Mol. Mass.:
272417.95
Organism:
Homo sapiens (Human)
Description:
P46531
Residue:
2555
  
Inhibitor
Name:
BDBM50074771
Synonyms:
CHEMBL3410153
Type:
Small organic molecule
Emp. Form.:
C28H33F3N4O3
Mol. Mass.:
530.5818
SMILES:
CCC(CC)[C@@H]([C@@H](CCC(F)(F)F)C(=O)N[C@H]1N=C(c2ccccc2)c2ccccc2N(C)C1=O)C(N)=O
: