Target
Tyrosine-protein kinase SYK
Ligand
BDBM50204291
Substrate
Meas. Tech.
ChEMBL_1627194 (CHEMBL3869715)
EC50
<3.0±n/a nM
Citation
 Lam, BArikawa, YCramlett, JDong, Qde Jong, RFeher, VGrimshaw, CEFarrell, PJHoffman, IDJennings, AJones, BMatuszkiewicz, JMiura, JMiyake, HNatala, SRShi, LTakahashi, MTaylor, EWyrick, CYano, JZalevsky, JNie, Z Discovery of TAK-659 an orally available investigational inhibitor of Spleen Tyrosine Kinase (SYK). Bioorg Med Chem Lett 26:5947-5950 (2016)  
Target
Name:
Tyrosine-protein kinase SYK
Synonyms:
KSYK_HUMAN Spleen Tyrosine Kinase Tyrosine-protein kinase SYK (Syk)
Type:
Enzyme
Mol. Mass.:
72079.99
Organism:
Homo sapiens (Human)
Description:
P43405
Residue:
635
  
Inhibitor
Name:
BDBM50204291
Synonyms:
CHEMBL3953104 | US20230295171, Example 76
Type:
Small organic molecule
Emp. Form.:
C21H24N6O
Mol. Mass.:
376.4549
SMILES:
Cc1cccc(Nc2nc(N[C@@H]3CCCC[C@@H]3N)c(C#N)c3CNC(=O)c23)c1
: