Target
Tyrosine-protein kinase SYK
Ligand
BDBM620222
Substrate
Meas. Tech.
ChEMBL_1627194 (CHEMBL3869715)
EC50
4.0±n/a nM
Citation
 Lam, BArikawa, YCramlett, JDong, Qde Jong, RFeher, VGrimshaw, CEFarrell, PJHoffman, IDJennings, AJones, BMatuszkiewicz, JMiura, JMiyake, HNatala, SRShi, LTakahashi, MTaylor, EWyrick, CYano, JZalevsky, JNie, Z Discovery of TAK-659 an orally available investigational inhibitor of Spleen Tyrosine Kinase (SYK). Bioorg Med Chem Lett 26:5947-5950 (2016)  
Target
Name:
Tyrosine-protein kinase SYK
Synonyms:
KSYK_HUMAN Spleen Tyrosine Kinase Tyrosine-protein kinase SYK (Syk)
Type:
Enzyme
Mol. Mass.:
72079.99
Organism:
Homo sapiens (Human)
Description:
P43405
Residue:
635
  
Inhibitor
Name:
BDBM620222
Synonyms:
BDBM50204292 | US20230295171, Example 82
Type:
Small organic molecule
Emp. Form.:
C23H27N7O
Mol. Mass.:
417.5068
SMILES:
Cc1cccc(Nc2nc(N[C@@H]3CCCC[C@@H]3N)c(-c3cn[nH]c3)c3CNC(=O)c23)c1
: