Target
Tyrosine-protein kinase SYK
Ligand
BDBM50204295
Substrate
Meas. Tech.
ChEMBL_1627194 (CHEMBL3869715)
EC50
9.0±n/a nM
Citation
 Lam, BArikawa, YCramlett, JDong, Qde Jong, RFeher, VGrimshaw, CEFarrell, PJHoffman, IDJennings, AJones, BMatuszkiewicz, JMiura, JMiyake, HNatala, SRShi, LTakahashi, MTaylor, EWyrick, CYano, JZalevsky, JNie, Z Discovery of TAK-659 an orally available investigational inhibitor of Spleen Tyrosine Kinase (SYK). Bioorg Med Chem Lett 26:5947-5950 (2016)  
Target
Name:
Tyrosine-protein kinase SYK
Synonyms:
KSYK_HUMAN Spleen Tyrosine Kinase Tyrosine-protein kinase SYK (Syk)
Type:
Enzyme
Mol. Mass.:
72079.99
Organism:
Homo sapiens (Human)
Description:
P43405
Residue:
635
  
Inhibitor
Name:
BDBM50204295
Synonyms:
CHEMBL3944381
Type:
Small organic molecule
Emp. Form.:
C21H21N7O
Mol. Mass.:
387.4377
SMILES:
N[C@H]1CCCC[C@H]1Nc1nc(-c2cnn3ccccc23)c2C(=O)NCc2c1C#N
: