Target
cGMP-specific 3',5'-cyclic phosphodiesterase
Ligand
BDBM50117721
Substrate
Meas. Tech.
ChEBML_155212
IC50
5.5±n/a nM
Citation
 Arnold, RBeer, DBhalay, GBaettig, UCollingwood, SPCraig, SDevereux, NDunstan, AGlen, AGomez, SHaberthuer, SHowe, TJelfs, SMoser, HNaef, RNicklin, PSandham, DStringer, RTurner, KWatson, SZurini, M 8-Aryl xanthines potent inhibitors of phosphodiesterase 5. Bioorg Med Chem Lett 12:2587-90 (2002)  
Target
Name:
cGMP-specific 3',5'-cyclic phosphodiesterase
Synonyms:
3',5'-cyclic phosphodiesterase PDE5 PDE5A_HUMAN Phosphodiesterase 5 (PDE5) Phosphodiesterase 5A (PDE5A) cGMP-specific 3',5'-cyclic phosphodiesterase
Type:
Protein
Mol. Mass.:
99975.83
Organism:
Homo sapiens (Human)
Description:
O76074
Residue:
875
  
Inhibitor
Name:
BDBM50117721
Synonyms:
3-Isobutyl-1-methyl-8-[5-(piperazin-1-ylmethanesulfonyl)-2-propoxy-phenyl]-3,7-dihydro-purine-2,6-dione | CHEMBL315477
Type:
Small organic molecule
Emp. Form.:
C25H36N6O5S
Mol. Mass.:
532.656
SMILES:
CCCOc1ccc(cc1-c1nc2n(CC(C)C)c(=O)n(C)c(=O)c2[nH]1)S(=O)(=O)N1CCN(CC)CC1
: