Target
MAP kinase-activated protein kinase 2
Ligand
BDBM50305012
Substrate
Meas. Tech.
ChEMBL_606910 (CHEMBL1072653)
IC50
1900±n/a nM
Citation
 Harris, CMEricsson, AMArgiriadi, MABarberis, CBorhani, DWBurchat, ACalderwood, DJCunha, GADixon, RWFrank, KEJohnson, EFKamens, JKwak, SLi, BMullen, KDPerron, DCWang, LWishart, NWu, XZhang, XZmetra, TRTalanian, RV 2,4-Diaminopyrimidine MK2 inhibitors. Part II: Structure-based inhibitor optimization. Bioorg Med Chem Lett 20:334-7 (2010)  
Target
Name:
MAP kinase-activated protein kinase 2
Synonyms:
MAP kinase-activated protein kinase 2 (MAPKAPK2) MAP kinase-activated protein kinase 2 (p38/MK2) MAPK-activated protein kinase 2 MAPKAP kinase 2 MAPKAPK2 | MK2
Type:
Serine/threonine-protein kinase
Mol. Mass.:
45579.87
Organism:
Homo sapiens (Human)
Description:
P49137
Residue:
400
  
Inhibitor
Name:
BDBM50305012
Synonyms:
2-(2-amino-7-(7-(benzo[b]thiophen-2-yl)-1H-indazol-5-yl)-5H-pyrrolo[3,2-d]pyrimidin-5-yl)acetic acid | CHEMBL596588
Type:
Small organic molecule
Emp. Form.:
C23H16N6O2S
Mol. Mass.:
440.477
SMILES:
Nc1ncc2n(CC(O)=O)cc(-c3cc(-c4cc5ccccc5s4)c4[nH]ncc4c3)c2n1
: