Target
Beta-2 adrenergic receptor
Ligand
BDBM50419694
Substrate
Meas. Tech.
ChEMBL_800669 (CHEMBL1947791)
IC50
13±n/a nM
Citation
 Alcaraz, LBailey, ACadogan, EConnolly, SJewell, RJordan, SKindon, NLister, ALawson, MMullen, ADainty, INicholls, DPaine, SPairaudeau, GStocks, MJThorne, PYoung, A From libraries to candidate: the discovery of new ultra long-acting dibasicß2-adrenoceptor agonists. Bioorg Med Chem Lett 22:689-95 (2011)  
Target
Name:
Beta-2 adrenergic receptor
Synonyms:
ADRB2 ADRB2_HUMAN Beta-2 adrenoceptor | Beta-2 adrenoreceptor
Type:
Mol. Mass.:
46461.69
Organism:
Homo sapiens (Human)
Description:
P07550
Residue:
413
  
Inhibitor
Name:
BDBM50419694
Synonyms:
CHEMBL1946765
Type:
Small organic molecule
Emp. Form.:
C27H29N3O2S
Mol. Mass.:
459.603
SMILES:
Oc1ccc(CCNCCc2cccc(CN[C@H]3C[C@@H]3c3ccccc3)c2)c2sc(=O)[nH]c12
: