BDBM50009647 BUTIN::CHEBI:27725
SMILES Oc1ccc2C(=O)C[C@H](Oc2c1)c1ccc(O)c(O)c1
InChI Key InChIKey=MJBPUQUGJNAPAZ-AWEZNQCLSA-N
Data  1 IC50
  Tab Delimited (TSV)   2D SDfile   Computed 3D by Vconf -m prep SDfile
Find this compound or compounds like it in BindingDB:
Activity Spreadsheet -- Enzyme Inhibition Constant Data from BindingDB
Found 1 hit for monomerid = 50009647
TargetAromatase(Homo sapiens (Human))
Hanyang University
Curated by ChEMBL
LigandPNGBDBM50009647(BUTIN | CHEBI:27725)
Affinity DataIC50:  9.60E+3nM. Assay description: Inhibition of human aromatase using androstenedione as substrate assessed as estrone formation at 10 uM after 30 mins by LC-MS/MS analysis
In DepthDetails ArticlePubMed