BDBM50107086 CHEMBL108673::[5-(4-Bromo-2-methyl-phenyl)-1-methyl-1H-[1,2,4]triazol-3-yl]-dicyclopropylmethyl-propyl-amine
SMILES CCCN(C(C1CC1)C1CC1)c1nc(-c2ccc(Br)cc2C)n(C)n1
InChI Key InChIKey=BDJWEDZATUQOAA-UHFFFAOYSA-N
Data  1 KI
  Tab Delimited (TSV)   2D SDfile   Computed 3D by Vconf -m prep SDfile
Find this compound or compounds like it in BindingDB:
Activity Spreadsheet -- Enzyme Inhibition Constant Data from BindingDB
Found 1 hit for monomerid = 50107086
TargetCorticotropin-releasing factor receptor 1(Homo sapiens (Human))
Neurocrine Biosciences
Curated by ChEMBL
LigandPNGBDBM50107086(CHEMBL108673 | [5-(4-Bromo-2-methyl-phenyl)-1-meth...)
Affinity DataKi:  10nM. Assay description: Inhibition of [125I]-o-CRF binding to human Corticotrophin releasing factor receptor 1 expressed in CHO cells.
In DepthDetails ArticlePubMed