BDBM50499190 CHEBI:29200::THIOCYANIC ACID::Thiocyanate
SMILES SC#N
InChI Key InChIKey=ZMZDMBWJUHKJPS-UHFFFAOYSA-N
Data  2 KI
  Tab Delimited (TSV)   2D SDfile   Computed 3D by Vconf -m prep SDfile
Find this compound or compounds like it in BindingDB:
Activity Spreadsheet -- Enzyme Inhibition Constant Data from BindingDB
Found 2 hits for monomerid = 50499190
TargetCarbonic anhydrase 1(Homo sapiens (Human))
Universit£
Curated by ChEMBL
LigandPNGBDBM50499190(CHEBI:29200 | THIOCYANIC ACID | Thiocyanate)
Affinity DataKi:  2.00E+5nM. Assay description: Inhibition of human CA1 incubated for 15 mins prior to testing by stopped flow CO2 hydrase assay
In DepthDetails ArticlePubMed
TargetCarbonic anhydrase 2(Homo sapiens (Human))
Universit£
Curated by ChEMBL
LigandPNGBDBM50499190(CHEBI:29200 | THIOCYANIC ACID | Thiocyanate)
Affinity DataKi:  1.60E+6nM. Assay description: Inhibition of human CA2 incubated for 15 mins prior to testing by stopped flow CO2 hydrase assay
In DepthDetails ArticlePubMed