BDBM104698 US8569311, 1-4
SMILES C[C@@H]1CC[C@@H](COc2ccc(F)cn2)CN1C(=O)c1ccccc1-n1nccn1
InChI Key InChIKey=GRALYLLGLCRICT-HZPDHXFCSA-N
Data  2 KI
  Tab Delimited (TSV)   2D SDfile   Computed 3D by Vconf -m prep SDfile
Find this compound or compounds like it in BindingDB:
Activity Spreadsheet -- Enzyme Inhibition Constant Data from BindingDB
Found 2 hits for monomerid = 104698
TargetOrexin receptor type 2(Rattus norvegicus (Rat))
Merch Sharp & Dohme
US Patent
LigandPNGBDBM104698(US8569311, 1-4)
Affinity DataKi:  0.370nM. Assay description: Radioligand binding assay described in Bergman et. al. Bioorg. Med. Chem. Lett. 2008, 18, 1425-1430.
In DepthDetails US Patent
TargetOrexin/Hypocretin receptor type 1(Rattus norvegicus (Rat))
Merch Sharp & Dohme
US Patent
LigandPNGBDBM104698(US8569311, 1-4)
Affinity DataKi:  12nM. Assay description: Radioligand binding assay described in Bergman et. al. Bioorg. Med. Chem. Lett. 2008, 18, 1425-1430.
In DepthDetails US Patent